每天叁遍ca88会员登录中心,Linux下tomcat服务器安插web项目

ca88会员登录中心 1
ca88会员登录中心

行使工具:SecureFX 7.0,SecureCRT 7.0

JCE cannot authenticate the provider NUIMCSCGIBE
IbeProvider.class
package nuim.cs.crypto.ibe;

tomcat7 PermGen space 每一日叁回 50C
ca88会员登录中心,Exception in thread “http-bio-443-exec-1832” at
sun.misc.Unsafe.defineClass(Native Method)
at sun.reflect.ClassDefiner.defineClass(ClassDefiner.java:63)
at
sun.reflect.MethodAccessorGenerator$1.run(MethodAccessorGenerator.java:399)
at
sun.reflect.MethodAccessorGenerator$1.run(MethodAccessorGenerator.java:396)
at java.security.AccessController.doPrivileged(Native Method)
at
sun.reflect.MethodAccessorGenerator.generate(MethodAccessorGenerator.java:395)
at
sun.reflect.MethodAccessorGenerator.generateConstructor(MethodAccessorGenerator.java:94)
at
sun.reflect.NativeConstructorAccessorImpl.newInstance(NativeConstructorAccessorImpl.java:48)
at
sun.reflect.DelegatingConstructorAccessorImpl.newInstance(DelegatingConstructorAccessorImpl.java:45)
at java.lang.reflect.Constructor.newInstance(Constructor.java:526)
at java.security.Provider$Service.newInstance(Provider.java:1240)
at javax.crypto.Cipher.chooseProvider(Cipher.java:845)
at javax.crypto.Cipher.init(Cipher.java:1348)
at sun.security.ssl.CipherBox.(CipherBox.java:175)
at sun.security.ssl.CipherBox.newCipherBox(CipherBox.java:208)
at
sun.security.ssl.CipherSuite$BulkCipher.newCipher(CipherSuite.java:471)
at sun.security.ssl.Handshaker.newReadCipher(Handshaker.java:707)
at
sun.security.ssl.SSLSocketImpl.changeReadCiphers(SSLSocketImpl.java:2063)
at sun.security.ssl.SSLSocketImpl.readRecord(SSLSocketImpl.java:1117)
at
sun.security.ssl.SSLSocketImpl.performInitialHandshake(SSLSocketImpl.java:1332)
at
sun.security.ssl.SSLSocketImpl.startHandshake(SSLSocketImpl.java:1359)
at sun.security.ssl.SSLSocketImpl.getSession(SSLSocketImpl.java:2191)
at
org.apache.tomcat.util.net.jsse.JSSESocketFactory.handshake(JSSESocketFactory.java:252)
at
org.apache.tomcat.util.net.JIoEndpoint$SocketProcessor.run(JIoEndpoint.java:304)
at
java.util.concurrent.ThreadPoolExecutor.runWorker(ThreadPoolExecutor.java:1145)
at
java.util.concurrent.ThreadPoolExecutor$Worker.run(ThreadPoolExecutor.java:615)
at
org.apache.tomcat.util.threads.TaskThread$WrappingRunnable.run(TaskThread.java:61)
at java.lang.Thread.run(Thread.java:745)
java.lang.OutOfMemoryError: PermGen space
at sun.misc.Unsafe.defineClass(Native Method)
at sun.reflect.ClassDefiner.defineClass(ClassDefiner.java:63)
at
sun.reflect.MethodAccessorGenerator$1.run(MethodAccessorGenerator.java:399)
at
sun.reflect.MethodAccessorGenerator$1.run(MethodAccessorGenerator.java:396)
at java.security.AccessController.doPrivileged(Native Method)
at
sun.reflect.MethodAccessorGenerator.generate(MethodAccessorGenerator.java:395)
at
sun.reflect.MethodAccessorGenerator.generateConstructor(MethodAccessorGenerator.java:94)
at
sun.reflect.NativeConstructorAccessorImpl.newInstance(NativeConstructorAccessorImpl.java:48)
at
sun.reflect.DelegatingConstructorAccessorImpl.newInstance(DelegatingConstructorAccessorImpl.java:45)
at java.lang.reflect.Constructor.newInstance(Constructor.java:526)
at java.security.Provider$Service.newInstance(Provider.java:1240)
at javax.crypto.Cipher.chooseProvider(Cipher.java:845)
at javax.crypto.Cipher.init(Cipher.java:1348)
at sun.security.ssl.CipherBox.(CipherBox.java:175)
at sun.security.ssl.CipherBox.newCipherBox(CipherBox.java:208)
at
sun.security.ssl.CipherSuite$BulkCipher.newCipher(CipherSuite.java:471)
at sun.security.ssl.Handshaker.newReadCipher(Handshaker.java:707)
at
sun.security.ssl.SSLSocketImpl.changeReadCiphers(SSLSocketImpl.java:2063)
at sun.security.ssl.SSLSocketImpl.readRecord(SSLSocketImpl.java:1117)
at
sun.security.ssl.SSLSocketImpl.performInitialHandshake(SSLSocketImpl.java:1332)
at
sun.security.ssl.SSLSocketImpl.startHandshake(SSLSocketImpl.java:1359)
at sun.security.ssl.SSLSocketImpl.getSession(SSLSocketImpl.java:2191)
at
org.apache.tomcat.util.net.jsse.JSSESocketFactory.handshake(JSSESocketFactory.java:252)
at
org.apache.tomcat.util.net.JIoEndpoint$SocketProcessor.run(JIoEndpoint.java:304)
at
java.util.concurrent.ThreadPoolExecutor.runWorker(ThreadPoolExecutor.java:1145)
at
java.util.concurrent.ThreadPoolExecutor$Worker.run(ThreadPoolExecutor.java:615)
at
org.apache.tomcat.util.threads.TaskThread$WrappingRunnable.run(TaskThread.java:61)
at java.lang.Thread.run(Thread.java:745)
java.lang.OutOfMemoryError: PermGen space
at sun.misc.Unsafe.defineClass(Native Method)
at sun.reflect.ClassDefiner.defineClass(ClassDefiner.java:63)
at
sun.reflect.MethodAccessorGenerator$1.run(MethodAccessorGenerator.java:399)
at
sun.reflect.MethodAccessorGenerator$1.run(MethodAccessorGenerator.java:396)
at java.security.AccessController.doPrivileged(Native Method)
at
sun.reflect.MethodAccessorGenerator.generate(MethodAccessorGenerator.java:395)
at
sun.reflect.MethodAccessorGenerator.generateConstructor(MethodAccessorGenerator.java:94)
at
sun.reflect.NativeConstructorAccessorImpl.newInstance(NativeConstructorAccessorImpl.java:48)
at
sun.reflect.DelegatingConstructorAccessorImpl.newInstance(DelegatingConstructorAccessorImpl.java:45)
at java.lang.reflect.Constructor.newInstance(Constructor.java:526)
at java.security.Provider$Service.newInstance(Provider.java:1240)
at javax.crypto.Cipher.chooseProvider(Cipher.java:845)
at javax.crypto.Cipher.init(Cipher.java:1348)
at sun.security.ssl.CipherBox.(CipherBox.java:175)
at sun.security.ssl.CipherBox.newCipherBox(CipherBox.java:208)
at
sun.security.ssl.CipherSuite$BulkCipher.newCipher(CipherSuite.java:471)
at sun.security.ssl.Handshaker.newReadCipher(Handshaker.java:707)
at
sun.security.ssl.SSLSocketImpl.changeReadCiphers(SSLSocketImpl.java:2063)
at sun.security.ssl.SSLSocketImpl.readRecord(SSLSocketImpl.java:1117)
at
sun.security.ssl.SSLSocketImpl.performInitialHandshake(SSLSocketImpl.java:1332)
at
sun.security.ssl.SSLSocketImpl.startHandshake(SSLSocketImpl.java:1359)
at sun.security.ssl.SSLSocketImpl.getSession(SSLSocketImpl.java:2191)
at
org.apache.tomcat.util.net.jsse.JSSESocketFactory.handshake(JSSESocketFactory.java:252)
at
org.apache.tomcat.util.net.JIoEndpoint$SocketProcessor.run(JIoEndpoint.java:304)
at
java.util.concurrent.ThreadPoolExecutor.runWorker(ThreadPoolExecutor.java:1145)
at
java.util.concurrent.ThreadPoolExecutor$Worker.run(ThreadPoolExecutor.java:615)
at
org.apache.tomcat.util.threads.TaskThread$WrappingRunnable.run(TaskThread.java:61)
at java.lang.Thread.run(Thread.java:745)
java.lang.OutOfMemoryError: PermGen space
at sun.misc.Unsafe.defineClass(Native Method)
at sun.reflect.ClassDefiner.defineClass(ClassDefiner.java:63)
at
sun.reflect.MethodAccessorGenerator$1.run(MethodAccessorGenerator.java:399)
at
sun.reflect.MethodAccessorGenerator$1.run(MethodAccessorGenerator.java:396)
at java.security.AccessController.doPrivileged(Native Method)
at
sun.reflect.MethodAccessorGenerator.generate(MethodAccessorGenerator.java:395)
at
sun.reflect.MethodAccessorGenerator.generateConstructor(MethodAccessorGenerator.java:94)
at
sun.reflect.NativeConstructorAccessorImpl.newInstance(NativeConstructorAccessorImpl.java:48)
at
sun.reflect.DelegatingConstructorAccessorImpl.newInstance(DelegatingConstructorAccessorImpl.java:45)
at java.lang.reflect.Constructor.newInstance(Constructor.java:526)
at java.security.Provider$Service.newInstance(Provider.java:1240)
at javax.crypto.Cipher.chooseProvider(Cipher.java:845)
at javax.crypto.Cipher.init(Cipher.java:1348)
at sun.security.ssl.CipherBox.(CipherBox.java:175)
at sun.security.ssl.CipherBox.newCipherBox(CipherBox.java:208)
at
sun.security.ssl.CipherSuite$BulkCipher.newCipher(CipherSuite.java:471)
at sun.security.ssl.Handshaker.newReadCipher(Handshaker.java:707)
at
sun.security.ssl.SSLSocketImpl.changeReadCiphers(SSLSocketImpl.java:2063)
at sun.security.ssl.SSLSocketImpl.readRecord(SSLSocketImpl.java:1117)
at
sun.security.ssl.SSLSocketImpl.performInitialHandshake(SSLSocketImpl.java:1332)
at
sun.security.ssl.SSLSocketImpl.startHandshake(SSLSocketImpl.java:1359)
at sun.security.ssl.SSLSocketImpl.getSession(SSLSocketImpl.java:2191)
at
org.apache.tomcat.util.net.jsse.JSSESocketFactory.handshake(JSSESocketFactory.java:252)
at
org.apache.tomcat.util.net.JIoEndpoint$SocketProcessor.run(JIoEndpoint.java:304)
at
java.util.concurrent.ThreadPoolExecutor.runWorker(ThreadPoolExecutor.java:1145)
at
java.util.concurrent.ThreadPoolExecutor$Worker.run(ThreadPoolExecutor.java:615)
at
org.apache.tomcat.util.threads.TaskThread$WrappingRunnable.run(TaskThread.java:61)
at java.lang.Thread.run(Thread.java:745)
Exception in thread “http-bio-443-exec-2025” java.lang.OutOfMemoryError:
PermGen space

1.将web项目打包

import java.security.Provider;

2.将jar包上传到tomcat服务器的webapps目录下

/**

ca88会员登录中心 1

  • This class provides a key pair generator and an El-Gamal based
    cipher for
  • Identity Based Encryption .
    /
    public class IbeProvider extends Provider {
    /
    * the name of the cipher and key pair generators for ibe /
    public static final String IBE = new String;
    /
    *

    • */private static final long serialVersionUID = 1L;

    /**

    • Creates a new instance of the Crypto Group’s provider for IBE.
      */
      public IbeProvider() {
      super(“NUIMCSCGIBE”, 1.0, “NUIM CS CG IBE Crypto Provider”);

      // clears the superclass provider – don’t want any surprises
      clear();
      // add in our own implementations
      put(“KeyPairGenerator.” + IBE,
      IbeKeyPairGenerator.class.getName;
      put(“Cipher.” + IBE, IbeCipher.class.getName;
      }
      }

3.上传好通晓后运营tomcat服务器

错误报告:
Running nuim.cs.crypto.ibe.test.IbeProviderTest
Tests run: 3, Failures: 0, Errors: 2, Skipped: 0, Time elapsed: 0.594
sec <<< FAILURE!
testCipher(nuim.cs.crypto.ibe.test.IbeProviderTest) Time elapsed: 0.109
sec <<< ERROR!
java.lang.SecurityException: JCE cannot authenticate the provider
NUIMCSCGIBE
at javax.crypto.Cipher.getInstance(Cipher.java:642)
at
nuim.cs.crypto.ibe.test.IbeProviderTest.testCipher(IbeProviderTest.java:41)
at sun.reflect.NativeMethodAccessorImpl.invoke0(Native Method)
at
sun.reflect.NativeMethodAccessorImpl.invoke(NativeMethodAccessorImpl.java:57)
at
sun.reflect.DelegatingMethodAccessorImpl.invoke(DelegatingMethodAccessorImpl.java:43)
at java.lang.reflect.Method.invoke(Method.java:606)
at junit.framework.TestCase.runTest(TestCase.java:176)
at junit.framework.TestCase.runBare(TestCase.java:141)
at junit.framework.TestResult$1.protect(TestResult.java:122)
at junit.framework.TestResult.runProtected(TestResult.java:142)
at junit.framework.TestResult.run(TestResult.java:125)
at junit.framework.TestCase.run(TestCase.java:129)
at junit.framework.TestSuite.runTest(TestSuite.java:255)
at junit.framework.TestSuite.run(TestSuite.java:250)
at
org.junit.internal.runners.JUnit38ClassRunner.run(JUnit38ClassRunner.java:84)
at
org.apache.maven.surefire.junit4.JUnit4Provider.execute(JUnit4Provider.java:252)
at
org.apache.maven.surefire.junit4.JUnit4Provider.executeTestSet(JUnit4Provider.java:141)
at
org.apache.maven.surefire.junit4.JUnit4Provider.invoke(JUnit4Provider.java:112)
at sun.reflect.NativeMethodAccessorImpl.invoke0(Native Method)
at
sun.reflect.NativeMethodAccessorImpl.invoke(NativeMethodAccessorImpl.java:57)
at
sun.reflect.DelegatingMethodAccessorImpl.invoke(DelegatingMethodAccessorImpl.java:43)
at java.lang.reflect.Method.invoke(Method.java:606)
at
org.apache.maven.surefire.util.ReflectionUtils.invokeMethodWithArray(ReflectionUtils.java:189)
at
org.apache.maven.surefire.booter.ProviderFactory$ProviderProxy.invoke(ProviderFactory.java:165)
at
org.apache.maven.surefire.booter.ProviderFactory.invokeProvider(ProviderFactory.java:85)
at
org.apache.maven.surefire.booter.ForkedBooter.runSuitesInProcess(ForkedBooter.java:115)
at
org.apache.maven.surefire.booter.ForkedBooter.main(ForkedBooter.java:75)
Caused by: java.lang.SecurityException: Cannot verify
jar:file:/F:/Workspace/GitHub/IBE/framework/target/classes/!/
at javax.crypto.JarVerifier.verifySingleJar(JarVerifier.java:406)
at javax.crypto.JarVerifier.verifyJars(JarVerifier.java:322)
at javax.crypto.JarVerifier.verify(JarVerifier.java:250)
at javax.crypto.JceSecurity.verifyProviderJar(JceSecurity.java:161)
at
javax.crypto.JceSecurity.getVerificationResult(JceSecurity.java:187)
at javax.crypto.Cipher.getInstance(Cipher.java:638)
… 26 more
Caused by: java.security.PrivilegedActionException:
java.io.FileNotFoundException:
F:\Workspace\GitHub\IBE\framework\target\classes
at java.security.AccessController.doPrivileged(Native Method)
at javax.crypto.JarVerifier.verifySingleJar(JarVerifier.java:384)
… 31 more
Caused by: java.io.FileNotFoundException:
F:\Workspace\GitHub\IBE\framework\target\classes
at java.util.zip.ZipFile.open(Native Method)
at java.util.zip.ZipFile.(ZipFile.java:215)
at java.util.zip.ZipFile.(ZipFile.java:145)
at java.util.jar.JarFile.(JarFile.java:154)
at java.util.jar.JarFile.(JarFile.java:91)
at sun.net.www.protocol.jar.URLJarFile.(URLJarFile.java:93)
at sun.net.www.protocol.jar.URLJarFile.getJarFile(URLJarFile.java:69)
at
sun.net.www.protocol.jar.JarFileFactory.get(JarFileFactory.java:109)
at
sun.net.www.protocol.jar.JarURLConnection.connect(JarURLConnection.java:122)
at
sun.net.www.protocol.jar.JarURLConnection.getJarFile(JarURLConnection.java:89)
at javax.crypto.JarVerifier$2.run(JarVerifier.java:399)
… 33 more

ca88会员登录中心 2

testCreateCipher(nuim.cs.crypto.ibe.test.IbeProviderTest) Time elapsed:
0 sec <<< ERROR!
java.lang.SecurityException: JCE cannot authenticate the provider
NUIMCSCGIBE
at javax.crypto.Cipher.getInstance(Cipher.java:642)
at
nuim.cs.crypto.ibe.test.IbeProviderTest.testCreateCipher(IbeProviderTest.java:147)
at sun.reflect.NativeMethodAccessorImpl.invoke0(Native Method)
at
sun.reflect.NativeMethodAccessorImpl.invoke(NativeMethodAccessorImpl.java:57)
at
sun.reflect.DelegatingMethodAccessorImpl.invoke(DelegatingMethodAccessorImpl.java:43)
at java.lang.reflect.Method.invoke(Method.java:606)
at junit.framework.TestCase.runTest(TestCase.java:176)
at junit.framework.TestCase.runBare(TestCase.java:141)
at junit.framework.TestResult$1.protect(TestResult.java:122)
at junit.framework.TestResult.runProtected(TestResult.java:142)
at junit.framework.TestResult.run(TestResult.java:125)
at junit.framework.TestCase.run(TestCase.java:129)
at junit.framework.TestSuite.runTest(TestSuite.java:255)
at junit.framework.TestSuite.run(TestSuite.java:250)
at
org.junit.internal.runners.JUnit38ClassRunner.run(JUnit38ClassRunner.java:84)
at
org.apache.maven.surefire.junit4.JUnit4Provider.execute(JUnit4Provider.java:252)
at
org.apache.maven.surefire.junit4.JUnit4Provider.executeTestSet(JUnit4Provider.java:141)
at
org.apache.maven.surefire.junit4.JUnit4Provider.invoke(JUnit4Provider.java:112)
at sun.reflect.NativeMethodAccessorImpl.invoke0(Native Method)
at
sun.reflect.NativeMethodAccessorImpl.invoke(NativeMethodAccessorImpl.java:57)
at
sun.reflect.DelegatingMethodAccessorImpl.invoke(DelegatingMethodAccessorImpl.java:43)
at java.lang.reflect.Method.invoke(Method.java:606)
at
org.apache.maven.surefire.util.ReflectionUtils.invokeMethodWithArray(ReflectionUtils.java:189)
at
org.apache.maven.surefire.booter.ProviderFactory$ProviderProxy.invoke(ProviderFactory.java:165)
at
org.apache.maven.surefire.booter.ProviderFactory.invokeProvider(ProviderFactory.java:85)
at
org.apache.maven.surefire.booter.ForkedBooter.runSuitesInProcess(ForkedBooter.java:115)
at
org.apache.maven.surefire.booter.ForkedBooter.main(ForkedBooter.java:75)
Caused by: java.lang.SecurityException: Cannot verify
jar:file:/F:/Workspace/GitHub/IBE/framework/target/classes/!/
at javax.crypto.JarVerifier.verifySingleJar(JarVerifier.java:406)
at javax.crypto.JarVerifier.verifyJars(JarVerifier.java:322)
at javax.crypto.JarVerifier.verify(JarVerifier.java:250)
at javax.crypto.JceSecurity.verifyProviderJar(JceSecurity.java:161)
at
javax.crypto.JceSecurity.getVerificationResult(JceSecurity.java:187)
at javax.crypto.Cipher.getInstance(Cipher.java:638)
… 26 more
Caused by: java.security.PrivilegedActionException:
java.io.FileNotFoundException:
F:\Workspace\GitHub\IBE\framework\target\classes
at java.security.AccessController.doPrivileged(Native Method)
at javax.crypto.JarVerifier.verifySingleJar(JarVerifier.java:384)
… 31 more
Caused by: java.io.FileNotFoundException:
F:\Workspace\GitHub\IBE\framework\target\classes
at java.util.zip.ZipFile.open(Native Method)
at java.util.zip.ZipFile.(ZipFile.java:215)
at java.util.zip.ZipFile.(ZipFile.java:145)
at java.util.jar.JarFile.(JarFile.java:154)
at java.util.jar.JarFile.(JarFile.java:91)
at sun.net.www.protocol.jar.URLJarFile.(URLJarFile.java:93)
at sun.net.www.protocol.jar.URLJarFile.getJarFile(URLJarFile.java:69)
at
sun.net.www.protocol.jar.JarFileFactory.get(JarFileFactory.java:109)
at
sun.net.www.protocol.jar.JarURLConnection.connect(JarURLConnection.java:122)
at
sun.net.www.protocol.jar.JarURLConnection.getJarFile(JarURLConnection.java:89)
at javax.crypto.JarVerifier$2.run(JarVerifier.java:399)
… 33 more

大许多的Linux系统暗许都设置了OpenJDK,假使不把团结装的jdk优先级调高,那么系统会私下认可运营OpenJDK,那时就能够报非常

javax.crypto.BadPaddingException: Invalid pad value!
at sun.security.pkcs11.P11Cipher$PKCS5Padding.unpad(P11Cipher.java:106)[sunpkcs11.jar:1.7.0_45]
at sun.security.pkcs11.P11Cipher.implDoFinal(P11Cipher.java:802)[sunpkcs11.jar:1.7.0_45]
at sun.security.pkcs11.P11Cipher.engineDoFinal(P11Cipher.java:542)[sunpkcs11.jar:1.7.0_45]
at sun.security.pkcs11.P11Cipher.engineDoFinal(P11Cipher.java:525)[sunpkcs11.jar:1.7.0_45]
at javax.crypto.Cipher.doFinal(Cipher.java:1922)[:1.7.0_45]
at com.idcq.appserver.utils.AESUtil.aesDecryptByBytes(AESUtil.java:193)[AESUtil.class:]
at com.idcq.appserver.utils.AESUtil.aesDecrypt(AESUtil.java:211)[AESUtil.class:]

削株掘根办法:

4.运维未来在浏览器上输入ip:8080/项目名

若果现身无法访谈,请检查端口8080是还是不是被防火墙拦截 ping ip 端口号 

假使总是退步,评释该端口号被阻碍

焚林而猎办法: 

发表评论

电子邮件地址不会被公开。 必填项已用*标注

网站地图xml地图